{"text_format":"1","workbook":"xlsx","n_sheets":5,"sheets":["Questionnaire","Réponses","Calculs","Profil","Références"],"not_rendered":{"charts":0,"images":2,"macros":1,"external_links":0,"defined_names":0,"comments":0,"pivot_tables":0},"unopened":[],"bounds":{"document_bytes":16777216,"sheet_cells":100000,"rows_first":2000,"rows_last":500,"rows_between":2000,"halvings":0,"cell_chars":16384,"cell_head_chars":4096},"cells_cut":0,"cells_raw":0,"read":"whole","date_system":"1900"}

{"sheet":"Questionnaire","index":0,"n_rows":0,"n_cols":0,"rows_kept":0,"cut":false,"hidden":false,"merged":[]}

{"sheet":"Réponses","index":1,"n_rows":74,"n_cols":4,"rows_kept":74,"cut":false,"hidden":false,"merged":[[1,0,1,3],[40,0,40,3],[64,0,64,3],[0,0,0,1],[0,2,0,3]]}
["Questions et réponses de l'élève"]
["Section 1"]
["1.1","J’ai été facilement distrait, j’ai eu du mal à poursuivre une activité quelconque.",null,{"$f":"VLOOKUP(C3,Calculs!G17:H19,2,FALSE)","v":{"$error":"#N/A"}}]
["1.2","Je n’ai pas pu me concentrer ou maintenir mon attention.",null,{"$f":"VLOOKUP(C4,Calculs!G17:H19,2,FALSE)","v":{"$error":"#N/A"}}]
["1.3","J’ai abandonné facilement.",null,{"$f":"VLOOKUP(C5,Calculs!G17:H19,2,FALSE)","v":{"$error":"#N/A"}}]
["1.4","J’étais « dans la lune ».",null,{"$f":"VLOOKUP(C6,Calculs!G17:H19,2,FALSE)","v":{"$error":"#N/A"}}]
["1.5","J’étais inattentif, j’ai eu de la difficulté à porter attention à ce que quelqu’un disait ou\nfaisait.",null,{"$f":"VLOOKUP(C7,Calculs!G17:H19,2,FALSE)","v":{"$error":"#N/A"}}]
["1.6","J’ai toujours donné le meilleur de moi-même pour faire mes travaux scolaires.",null,{"$f":"VLOOKUP(C8,Calculs!G27:H33,2,FALSE)","v":{"$error":"#N/A"}}]
["1.7","J’ai toujours mis beaucoup d’efforts dans mon travail.",null,{"$f":"VLOOKUP(C9,Calculs!G27:H33,2,FALSE)","v":{"$error":"#N/A"}}]
["1.8","J’étais facilement distrait quand j’étudiais pour mes cours.",null,{"$f":"VLOOKUP(C10,Calculs!G27:H33,2,FALSE)","v":{"$error":"#N/A"}}]
{"$rows_left_out":65}
{"sheet":"Calculs","index":2,"n_rows":603,"n_cols":135,"rows_kept":603,"cut":false,"hidden":true,"merged":[[0,125,0,134],[0,15,0,24],[0,25,0,34],[0,35,0,44],[0,45,0,54],[0,55,0,64],[0,65,0,74],[0,75,0,84],[0,85,0,94],[0,95,0,104],[0,105,0,114],[0,115,0,124],[1,37,1,38],[1,15,1,16],[1,17,1,18],[1,19,1,20],[1,21,1,22],[1,23,1,24],[1,25,1,26],[1,27,1,28],[1,29,1,30],[1,31,1,32],[1,33,1,34],[1,35,1,36],[1,61,1,62],[1,39,1,40],[1,41,1,42],[1,43,1,44],[1,45,1,46],[1,47,1,48],[1,49,1,50],[1,51,1,52],[1,53,1,54],[1,55,1,56],[1,57,1,58],[1,59,1,60],[1,85,1,86],[1,63,1,64],[1,65,1,66],[1,67,1,68],[1,69,1,70],[1,71,1,72],[1,73,1,74],[1,75,1,76],[1,77,1,78],[1,79,1,80],[1,81,1,82],[1,83,1,84],[1,109,1,110],[1,87,1,88],[1,89,1,90],[1,91,1,92],[1,93,1,94],[1,95,1,96],[1,97,1,98],[1,99,1,100],[1,101,1,102],[1,103,1,104],[1,105,1,106],[1,107,1,108],[1,133,1,134],[1,111,1,112],[1,113,1,114],[1,115,1,116],[1,117,1,118],[1,119,1,120],[1,121,1,122],[1,123,1,124],[1,125,1,126],[1,127,1,128],[1,129,1,130],[1,131,1,132]]}
["Question","Item","Réponse1","Réponse2",null,"Dimensions","Score",null,null,null,null,null,null,null,null,"AC",null,null,null,null,null,null,null,null,null,"ENG",null,null,null,null,null,null,null,null,null,"STRAT",null,null,null,null,null,null,null,null,null,"AIDE",null,null,null,null,null,null,null,null,null,"COMP",null,null,null,null,null,null,null,null,null,"BMA",null,null,null,null,null,null,null,null,null,"BEV",null,null,null,null,null,null,null,null,null,"SCOL",null,null,null,null,null,null,null,null,null,"SOC",null,null,null,null,null,null,null,null,null,"REJ",null,null,null,null,null,null,null,null,null,"PERF",null,null,null,null,null,null,null,null,null,"ANX"]
["1.1","att1",{"$f":"Réponses!C3","v":0},{"$f":"IF(C2=3,3,IF(C2=1,1,IF(C2=2,2,IF(C2=0,\"\"))))","v":""},null,"Problème d'attention en classe",{"$f":"AVERAGE(D2:D6)","v":{"$error":"#DIV/0!"}},null,null,null,null,null,null,null,null,"Q1",null,"Q2",null,"Q3",null,"Q4",null,"RE",null,"Q1",null,"Q2",null,"Q3",null,"Q4",null,"RE",null,"Q1",null,"Q2",null,"Q3",null,"Q4",null,"RE",null,"Q1",null,"Q2",null,"Q3",null,"Q4",null,"RE",null,"Q1",null,"Q2",null,"Q3",null,"Q4",null,"RE",null,"Q1",null,"Q2",null,"Q3",null,"Q4",null,"RE",null,"Q1",null,"Q2",null,"Q3",null,"Q4",null,"RE",null,"Q1",null,"Q2",null,"Q3",null,"Q4",null,"RE",null,"Q1",null,"Q2",null,"Q3",null,"Q4",null,"RE",null,"Q1",null,"Q2",null,"Q3",null,"Q4",null,"RE",null,"Q1",null,"Q2",null,"Q3",null,"Q4",null,"RE",null,"Q1",null,"Q2",null,"Q3",null,"Q4",null,"RE"]
["1.2","att2",{"$f":"Réponses!C4","v":0},{"$f":"IF(C3=3,3,IF(C3=1,1,IF(C3=2,2,IF(C3=0,\"\"))))","v":""},null,"Engagement scolaire",{"$f":"AVERAGE(D7:D12)","v":{"$error":"#DIV/0!"}},null,null,null,null,null,null,null,null,1,"X",1," ",1," ",1," ",1," ",1," ",1,"  ",1," ",1,"X",1,"X",1," ",1,"  ",1," ",1,"X",1,"X",1," ",1,"  ",1," ",1,"X",1,"X",1,"X",1," ",1," ",1," ",1," ",1," ",1," ",1," ",1,"X",1,"X",1,"X",1," ",1," ",1," ",1," ",1," ",1," ",1," ",1,"X",1,"X",1," ",1," ",1," ",1,"X",1,"X",1,"X",1," ",1," ",1," ",1," ",1,"X",1," ",1," ",1," ",1," ",1.01,"X",1.01," ",1.01," ",1.01," ",1.01," "]
["1.3","att3",{"$f":"Réponses!C5","v":0},{"$f":"IF(C4=3,3,IF(C4=1,1,IF(C4=2,2,IF(C4=0,\"\"))))","v":""},null,"Stratégies d'apprentissage",{"$f":"AVERAGE(D13:D29)","v":{"$error":"#DIV/0!"}},null,null,null,null,null,null,null,null,1.01,"X",1.01," ",1.01," ",1.01," ",1.01," ",1.01," ",1.01,"  ",1.01," ",1.01,"X",1.01,"X",1.01," ",1.01,"  ",1.01," ",1.01,"X",1.01,"X",1.01," ",1.01,"  ",1.01," ",1.01,"X",1.01,"X",1.01," ",1.01,"X",1.01," ",1.01," ",1.01," ",1.01," ",1.01," ",1.01," ",1.01,"X",1.01,"X",1.01,"X",1.01," ",1.01," ",1.01," ",1.01," ",1.01," ",1.01," ",1.01," ",1.01,"X",1.01,"X",1.01," ",1.01," ",1.01," ",1.01,"X",1.01,"X",1.01,"X",1.01," ",1.01," ",1.01," ",1.01," ",1.01,"X",1.01," ",1.01," ",1.01," ",1.01," ",1.02,"X",1.02," ",1.02," ",1.02," ",1.02," "]
["1.4","att4",{"$f":"Réponses!C6","v":0},"",null,"Demande d'aide à l'enseignant",{"$f":"AVERAGE(D30:D34)","v":{"$error":"#DIV/0!"}},null,null,null,null,null,null,null,null,1.02,"X",1.02," ",1.02," ",1.02," ",1.02," ",1.02," ",1.02,"  ",1.02," ",1.02,"X",1.02,"X",1.02," ",1.02,"  ",1.02," ",1.02,"X",1.02,"X",1.02," ",1.02,"  ",1.02," ",1.02,"X",1.02,"X",1.02," ",1.02,"X",1.02," ",1.02," ",1.02," ",1.02," ",1.02," ",1.02," ",1.02,"X",1.02,"X",1.02,"X",1.02," ",1.02," ",1.02," ",1.02," ",1.02," ",1.02," ",1.02," ",1.02,"X",1.02,"X",1.02," ",1.02," ",1.02," ",1.02,"X",1.02,"X",1.02,"X",1.02," ",1.02," ",1.02," ",1.02," ",1.02,"X",1.02," ",1.02," ",1.02," ",1.02," ",1.03,"X",1.03," ",1.03," ",1.03," ",1.03," "]
["1.5","att5",{"$f":"Réponses!C7","v":0},"",null,"Comportements dérangeants",{"$f":"AVERAGE(D35:D39)","v":{"$error":"#DIV/0!"}},null,null,null,null,null,null,null,null,1.03,"X",1.03," ",1.03," ",1.03," ",1.03," ",1.03," ",1.03,"  ",1.03," ",1.03,"X",1.03,"X",1.03," ",1.03,"  ",1.03," ",1.03,"X",1.03,"X",1.03," ",1.03,"  ",1.03," ",1.03,"X",1.03,"X",1.03," ",1.03,"X",1.03," ",1.03," ",1.03," ",1.03," ",1.03," ",1.03," ",1.03,"X",1.03,"X",1.03,"X",1.03," ",1.03," ",1.03," ",1.03," ",1.03," ",1.03," ",1.03," ",1.03,"X",1.03,"X",1.03," ",1.03," ",1.03," ",1.03,"X",1.03,"X",1.03,"X",1.03," ",1.03," ",1.03," ",1.03," ",1.03,"X",1.03," ",1.03," ",1.03," ",1.03," ",1.04,"X",1.04," ",1.04," ",1.04," ",1.04," "]
["1.6","eng1",{"$f":"Réponses!C8","v":0},{"$f":"IF(C7=1,1,IF(C7=2,2,IF(C7=3,3,IF(C7=4,4,IF(C7=5,5,IF(C7=6,6,IF(C7=7,7,IF(C7=0,\"\"))))))))","v":""},null,"Buts Maîtrise-approche",{"$f":"AVERAGE(D40:D42)","v":{"$error":"#DIV/0!"}},null,null,null,null,null,null,null,null,1.04,"X",1.04," ",1.04," ",1.04," ",1.04," ",1.04," ",1.04,"  ",1.04," ",1.04,"X",1.04,"X",1.04," ",1.04,"  ",1.04," ",1.04,"X",1.04,"X",1.04," ",1.04,"  ",1.04," ",1.04,"X",1.04,"X",1.04," ",1.04,"X",1.04," ",1.04," ",1.04," ",1.04," ",1.04," ",1.04," ",1.04,"X",1.04,"X",1.04,"X",1.04," ",1.04," ",1.04," ",1.04," ",1.04," ",1.04," ",1.04," ",1.04,"X",1.04,"X",1.04," ",1.04," ",1.04," ",1.04,"X",1.04,"X",1.04,"X",1.04," ",1.04," ",1.04," ",1.04," ",1.04,"X",1.04," ",1.04," ",1.04," ",1.04," ",1.05,"X",1.05," ",1.05," ",1.05," ",1.05," "]
["1.7","eng3",{"$f":"Réponses!C9","v":0},{"$f":"IF(C8=1,1,IF(C8=2,2,IF(C8=3,3,IF(C8=4,4,IF(C8=5,5,IF(C8=6,6,IF(C8=7,7,IF(C8=0,\"\"))))))))","v":""},null,"Buts Performance-évitement",{"$f":"AVERAGE(D43:D45)","v":{"$error":"#DIV/0!"}},null,null,null,null,null,null,null,null,1.05,"X",1.05," ",1.05," ",1.05," ",1.05," ",1.05," ",1.05,"  ",1.05," ",1.05,"X",1.05,"X",1.05," ",1.05,"  ",1.05," ",1.05,"X",1.05,"X",1.05," ",1.05,"  ",1.05," ",1.05,"X",1.05,"X",1.05," ",1.05,"X",1.05," ",1.05," ",1.05," ",1.05," ",1.05," ",1.05," ",1.05,"X",1.05,"X",1.05,"X",1.05," ",1.05," ",1.05," ",1.05," ",1.05," ",1.05," ",1.05," ",1.05,"X",1.05,"X",1.05," ",1.05," ",1.05," ",1.05,"X",1.05,"X",1.05,"X",1.05," ",1.05," ",1.05," ",1.05," ",1.05,"X",1.05," ",1.05," ",1.05," ",1.05," ",1.06,"X",1.06," ",1.06," ",1.06," ",1.06," "]
["1.8","eng4",{"$f":"Réponses!C10","v":0},{"$f":"IF(C9=1,7,IF(C9=2,6,IF(C9=3,5,IF(C9=4,4,IF(C9=5,3,IF(C9=6,2,IF(C9=7,1,IF(C9=0,\"\"))))))))","v":""},null,"Efficacité scolaire",{"$f":"AVERAGE(D46:D49)","v":{"$error":"#DIV/0!"}},null,null,null,null,null,null,null,null,1.06,"X",1.06," ",1.06," ",1.06," ",1.06," ",1.06," ",1.06,"  ",1.06," ",1.06,"X",1.06,"X",1.06," ",1.06,"  ",1.06," ",1.06,"X",1.06,"X",1.06," ",1.06,"  ",1.06," ",1.06,"X",1.06,"X",1.06," ",1.06,"X",1.06," ",1.06," ",1.06," ",1.06," ",1.06," ",1.06," ",1.06,"X",1.06,"X",1.06,"X",1.06," ",1.06," ",1.06," ",1.06," ",1.06," ",1.06," ",1.06," ",1.06,"X",1.06,"X",1.06," ",1.06," ",1.06," ",1.06,"X",1.06,"X",1.06,"X",1.06," ",1.06," ",1.06," ",1.06," ",1.06,"X",1.06," ",1.06," ",1.06," ",1.06," ",1.07,"X",1.07," ",1.07," ",1.07," ",1.07," "]
["1.9","eng5",{"$f":"Réponses!C11","v":0},{"$f":"IF(C10=1,7,IF(C10=2,6,IF(C10=3,5,IF(C10=4,4,IF(C10=5,3,IF(C10=6,2,IF(C10=7,1,IF(C10=0,\"\"))))))))","v":""},null,"Efficacité sociale",{"$f":"AVERAGE(D50:D56)","v":{"$error":"#DIV/0!"}},null,null,null,null,null,null,null,null,1.07,"X",1.07," ",1.07," ",1.07," ",1.07," ",1.07," ",1.07,"  ",1.07," ",1.07,"X",1.07,"X",1.07," ",1.07,"  ",1.07," ",1.07,"X",1.07,"X",1.07," ",1.07,"  ",1.07," ",1.07,"X",1.07,"X",1.07," ",1.07,"X",1.07," ",1.07," ",1.07," ",1.07," ",1.07," ",1.07," ",1.07,"X",1.07,"X",1.07,"X",1.07," ",1.07," ",1.07," ",1.07," ",1.07," ",1.07," ",1.07," ",1.07,"X",1.07,"X",1.07," ",1.07," ",1.07," ",1.07,"X",1.07,"X",1.07,"X",1.07," ",1.07," ",1.07," ",1.07," ",1.07,"X",1.07," ",1.07," ",1.07," ",1.07," ",1.08,"X",1.08," ",1.08," ",1.08," ",1.08," "]
{"$rows_left_out":594}
{"sheet":"Profil","index":3,"n_rows":24,"n_cols":14,"rows_kept":24,"cut":false,"hidden":false,"merged":[[4,0,7,0],[8,0,8,1],[9,0,9,1],[10,0,11,1],[0,1,0,13],[1,0,3,1],[1,2,1,6],[1,7,1,11],[1,12,1,13],[2,2,2,4],[2,5,2,6],[2,7,2,9],[2,10,2,11]]}
["Profil",{"$f":"Réponses!C1","v":0}]
[null,null,"Comportements",null,null,null,null,"Objectifs et préoccupations",null,null,null,null,"Émotions"]
[null,null,"Scolaire",null,null,"Social",null,"Scolaire",null,null,"Social",null,"Scolaire","Social"]
[null,null,"AC","ENG","STRAT","AIDE","COMP","BMA","BEV","SCOL","SOC","REJ","PERF","ANX"]
["Quartile",1,{"$f":"VLOOKUP(C10,Calculs!P3:Q203,2,TRUE)","v":{"$error":"#DIV/0!"}},{"$f":"VLOOKUP(D10,Calculs!Z3:AA603,2,TRUE)","v":{"$error":"#DIV/0!"}},{"$f":"VLOOKUP(E10,Calculs!AJ3:AK603,2,TRUE)","v":{"$error":"#DIV/0!"}},{"$f":"VLOOKUP(F10,Calculs!AT3:AU603,2,TRUE)","v":{"$error":"#DIV/0!"}},{"$f":"VLOOKUP(G10,Calculs!BD3:BE403,2,TRUE)","v":{"$error":"#DIV/0!"}},{"$f":"VLOOKUP(H10,Calculs!BN3:BO603,2,TRUE)","v":{"$error":"#DIV/0!"}},{"$f":"VLOOKUP(I10,Calculs!BX3:BY603,2,TRUE)","v":{"$error":"#DIV/0!"}},{"$f":"VLOOKUP(J10,Calculs!CH3:CI603,2,TRUE)","v":{"$error":"#DIV/0!"}},{"$f":"VLOOKUP(K10,Calculs!CR3:CS603,2,TRUE)","v":{"$error":"#DIV/0!"}},{"$f":"VLOOKUP(L10,Calculs!DB3:DC603,2,TRUE)","v":{"$error":"#DIV/0!"}},{"$f":"VLOOKUP(M10,Calculs!DL3:DM412,2,TRUE)","v":{"$error":"#DIV/0!"}},{"$f":"VLOOKUP(N10,Calculs!DV3:DW602,2,TRUE)","v":{"$error":"#DIV/0!"}}]
[null,2,{"$f":"VLOOKUP(C10,Calculs!R3:S203,2,TRUE)","v":{"$error":"#DIV/0!"}},{"$f":"VLOOKUP(D10,Calculs!AB3:AC603,2,TRUE)","v":{"$error":"#DIV/0!"}},{"$f":"VLOOKUP(E10,Calculs!AL3:AM603,2,TRUE)","v":{"$error":"#DIV/0!"}},{"$f":"VLOOKUP(F10,Calculs!AV3:AW603,2,TRUE)","v":{"$error":"#DIV/0!"}},{"$f":"VLOOKUP(G10,Calculs!BF3:BG403,2,TRUE)","v":{"$error":"#DIV/0!"}},{"$f":"VLOOKUP(H10,Calculs!BP3:BQ603,2,TRUE)","v":{"$error":"#DIV/0!"}},{"$f":"VLOOKUP(I10,Calculs!BZ3:CA603,2,TRUE)","v":{"$error":"#DIV/0!"}},{"$f":"VLOOKUP(J10,Calculs!CJ3:CK603,2,TRUE)","v":{"$error":"#DIV/0!"}},{"$f":"VLOOKUP(K10,Calculs!CT3:CU603,2,TRUE)","v":{"$error":"#DIV/0!"}},{"$f":"VLOOKUP(L10,Calculs!DD3:DE603,2,TRUE)","v":{"$error":"#DIV/0!"}},{"$f":"VLOOKUP(M10,Calculs!DN3:DO469,2,TRUE)","v":{"$error":"#DIV/0!"}},{"$f":"VLOOKUP(N10,Calculs!DX3:DY602,2,TRUE)","v":{"$error":"#DIV/0!"}}]
[null,3,{"$f":"VLOOKUP(C10,Calculs!T3:U203,2,TRUE)","v":{"$error":"#DIV/0!"}},{"$f":"VLOOKUP(D10,Calculs!AD3:AE603,2,TRUE)","v":{"$error":"#DIV/0!"}},{"$f":"VLOOKUP(E10,Calculs!AN3:AO603,2,TRUE)","v":{"$error":"#DIV/0!"}},{"$f":"VLOOKUP(F10,Calculs!AX3:AY603,2,TRUE)","v":{"$error":"#DIV/0!"}},{"$f":"VLOOKUP(G10,Calculs!BH3:BI403,2,TRUE)","v":{"$error":"#DIV/0!"}},{"$f":"VLOOKUP(H10,Calculs!BR3:BS603,2,TRUE)","v":{"$error":"#DIV/0!"}},{"$f":"VLOOKUP(I10,Calculs!CB3:CC603,2,TRUE)","v":{"$error":"#DIV/0!"}},{"$f":"VLOOKUP(J10,Calculs!CL3:CM603,2,TRUE)","v":{"$error":"#DIV/0!"}},{"$f":"VLOOKUP(K10,Calculs!CV3:CW603,2,TRUE)","v":{"$error":"#DIV/0!"}},{"$f":"VLOOKUP(L10,Calculs!DF3:DG603,2,TRUE)","v":{"$error":"#DIV/0!"}},{"$f":"VLOOKUP(M10,Calculs!DP3:DQ403,2,TRUE)","v":{"$error":"#DIV/0!"}},{"$f":"VLOOKUP(N10,Calculs!DZ3:EA602,2,TRUE)","v":{"$error":"#DIV/0!"}}]
[null,4,{"$f":"VLOOKUP(C10,Calculs!V3:W203,2,TRUE)","v":{"$error":"#DIV/0!"}},{"$f":"VLOOKUP(D10,Calculs!AF3:AG603,2,TRUE)","v":{"$error":"#DIV/0!"}},{"$f":"VLOOKUP(E10,Calculs!AP3:AQ603,2,TRUE)","v":{"$error":"#DIV/0!"}},{"$f":"VLOOKUP(F10,Calculs!AZ3:BA603,2,TRUE)","v":{"$error":"#DIV/0!"}},{"$f":"VLOOKUP(G10,Calculs!BJ3:BK403,2,TRUE)","v":{"$error":"#DIV/0!"}},{"$f":"VLOOKUP(H10,Calculs!BT3:BU603,2,TRUE)","v":{"$error":"#DIV/0!"}},{"$f":"VLOOKUP(I10,Calculs!CD3:CE603,2,TRUE)","v":{"$error":"#DIV/0!"}},{"$f":"VLOOKUP(J10,Calculs!CN3:CO603,2,TRUE)","v":{"$error":"#DIV/0!"}},{"$f":"VLOOKUP(K10,Calculs!CX3:CY603,2,TRUE)","v":{"$error":"#DIV/0!"}},{"$f":"VLOOKUP(L10,Calculs!DH3:DI603,2,TRUE)","v":{"$error":"#DIV/0!"}},{"$f":"VLOOKUP(M10,Calculs!DR3:DS404,2,TRUE)","v":{"$error":"#DIV/0!"}},{"$f":"VLOOKUP(N10,Calculs!EB3:EC602,2,TRUE)","v":{"$error":"#DIV/0!"}}]
["Rang extrême",null,{"$f":"VLOOKUP(C10,Calculs!X3:Y203,2,TRUE)","v":{"$error":"#DIV/0!"}},{"$f":"VLOOKUP(D10,Calculs!AH3:AI603,2,TRUE)","v":{"$error":"#DIV/0!"}},{"$f":"VLOOKUP(E10,Calculs!AR3:AS603,2,TRUE)","v":{"$error":"#DIV/0!"}},{"$f":"VLOOKUP(F10,Calculs!BB3:BC603,2,TRUE)","v":{"$error":"#DIV/0!"}},{"$f":"VLOOKUP(G10,Calculs!BL3:BM403,2,TRUE)","v":{"$error":"#DIV/0!"}},{"$f":"VLOOKUP(H10,Calculs!BV3:BW603,2,TRUE)","v":{"$error":"#DIV/0!"}},{"$f":"VLOOKUP(I10,Calculs!CF3:CG603,2,TRUE)","v":{"$error":"#DIV/0!"}},{"$f":"VLOOKUP(J10,Calculs!CP3:CQ603,2,TRUE)","v":{"$error":"#DIV/0!"}},{"$f":"VLOOKUP(K10,Calculs!CZ3:DA603,2,TRUE)","v":{"$error":"#DIV/0!"}},{"$f":"VLOOKUP(L10,Calculs!DJ3:DK603,2,TRUE)","v":{"$error":"#DIV/0!"}},{"$f":"VLOOKUP(M10,Calculs!DT3:DU463,2,TRUE)","v":{"$error":"#DIV/0!"}},{"$f":"VLOOKUP(N10,Calculs!ED3:EE602,2,TRUE)","v":{"$error":"#DIV/0!"}}]
["Score de l'élève",null,{"$f":"Calculs!G2","v":{"$error":"#DIV/0!"}},{"$f":"Calculs!G3","v":{"$error":"#DIV/0!"}},{"$f":"Calculs!G4","v":{"$error":"#DIV/0!"}},{"$f":"Calculs!G5","v":{"$error":"#DIV/0!"}},{"$f":"Calculs!G6","v":{"$error":"#DIV/0!"}},{"$f":"Calculs!G7","v":{"$error":"#DIV/0!"}},{"$f":"Calculs!G8","v":{"$error":"#DIV/0!"}},{"$f":"Calculs!G9","v":{"$error":"#DIV/0!"}},{"$f":"Calculs!G10","v":{"$error":"#DIV/0!"}},{"$f":"Calculs!G11","v":{"$error":"#DIV/0!"}},{"$f":"Calculs!G12","v":{"$error":"#DIV/0!"}},{"$f":"Calculs!G13","v":{"$error":"#DIV/0!"}}]
{"$rows_left_out":15}
{"sheet":"Références","index":4,"n_rows":11,"n_cols":1,"rows_kept":11,"cut":false,"hidden":false,"merged":[]}
["Achenbach, T. M. (1991). Manual for the child behavior checklist/4–18 and 1991 profile. Burlington, VT: University of Vermont, Department of Psychiatry."]
["Ang, R. P. & Huan, V. S. (2006). Academic expectations stress inventory (AESI) : Development, factor analisis, reliability, and validity. Education and Psychological Measurement, 66, 522-539. "]
["Bariaud, F. (2006). Le self-perception profile for adolescents (SPPA) de S.Harter: un questionnaire multidimentionnel d’évaluation de soi. L’Orientation Scolaire et Professionnelle, 35, 282-295."]
["Elliot, A. J. & Mc Gregor, H. A. (2001). A 2 X 2 achievement goal framework. Journal of Personality and Social Psychology, 80, 501-519."]
["Larose, S. & Roy, R. (1991). Test de réactions et d’adaptation au collégial (TRAC) : Guide d’utilisation et manuel  (2e édition). Sainte-Foy, Cégep de Sainte-Foy. ISBN 2-921299-05-4."]
["Larose, S., & Roy, R. (1995). Test of reactions and adaptation in college (TRAC) : A new measure of learning propensity for college students. Journal of Educational Psychology, 87, 296-306."]
["Losier, G. R, Vallerand, R. J., & Blais, M. R. (1993). Construction et validation de l'échelle des perceptions de competence dans les domaines de vie. Science et comportement, 23, 1 -16."]
["Midgley, C., Maehr, M. L., Hruda, L. A., Anderman, E., Anderman, L., Gheen, M., et al. (2000). Manual for the patterns of adaptive learning scale. Ann Arbor: University of Michigan."]
["Neary, A., & Joseph, S. (1994). Peer victimization and its relationship to self-concept and depression among schoolgirls. Personality and Individual Differences, 16, 183–186."]
["Larose, S. & Roy, R. (2001). L'inventaire des acquis précollégiaux: Guide d'utilisation.  Sainte-Foy: cégep de Sainte-Foy. ISBN 2-921299-43-7."]
{"$rows_left_out":1}